{"text_format":"1","workbook":"xlsx","n_sheets":8,"sheets":["Commentary","Project Info","Record Docs","App For Payment-Template","Certificates For Payment","Cert For Pay (Annual or Phased)","Lookups","Sheet1"],"not_rendered":{"charts":0,"images":1,"macros":1,"external_links":0,"defined_names":36,"comments":1,"pivot_tables":0},"unopened":[],"bounds":{"document_bytes":16777216,"sheet_cells":100000,"rows_first":2000,"rows_last":500,"rows_between":2000,"halvings":0,"cell_chars":16384,"cell_head_chars":4096},"cells_cut":0,"cells_raw":0,"read":"whole","date_system":"1904"}

{"sheet":"Commentary","index":0,"n_rows":94,"n_cols":3,"rows_kept":94,"cut":false,"hidden":false,"merged":[[92,2,92,12],[93,2,93,12],[91,2,91,12]]}
[]
[]
[]
[]
[]
[]
[]
[]
[]
[]
[]
[]
[]
[]
[]
[]
[]
[]
[]
[]
[]
[]
[]
[]
[]
[]
[]
[]
[]
[]
{"$rows_left_out":65}
{"sheet":"Project Info","index":1,"n_rows":87,"n_cols":12,"rows_kept":87,"cut":false,"hidden":false,"merged":[[9,1,9,11],[10,1,10,11],[10,12,10,22],[2,1,2,11],[6,1,6,11],[7,1,7,11],[8,1,8,11],[4,1,4,11],[3,1,3,11]]}
["Schedule of Values/Certificate for Payment workbook",null,null,null,null,null,null,null,null,null,null,"Rev. 2019 01"]
["History"]
[null,"The version was updated to work with the new Construction Act, and at the same time was expanded to work with the lien legislation of the other jurisdictions in Canada. It is made available through the OAA's PAR committee."]
[null,"The first public version was made available through the OAA's CCA committee. It worked with the Construction Lien Act of Ontario only."]
[null,"The original version of this workbook was developed 30 years ago to assist the author in checking applications for payment."]
["Initial Instructions:"]
[0,"The proper functioning of this workbook depends on the operation of macro programming written using Visual Basic for Applications (VBA). The VBA language is a part of the applications in the Microsoft Office suite. Unless macros are enabled, this workbook will not function properly."]
[null,"If used with malicious intent, VBA macros can  be used to attack or damage computer files. The macros used in this workbook copy tabs and information between tabs. They do not access any other file or the internet, nor have they caused any known issues with other programs."]
[null,"To avoid anyone easily tampering with the macros and circulating an infected file, access to the macros is protected. To protect yourself, you should download a copy of the workbook directly from the OAA web site. This also ensures you have the latest version of the workbook complete with any bug fixes and enhancements."]
[null,"Before this workbook will function, you wil need to enable macros by clicking on the button below the menu bar or by declaring this file to be a trusted file or by putting it in a trusted folder."]
[null,"When protected, you should be able to enter data into any of the green shaded cells. It is recommended that you protect the sheets to avoid accidentally changing or deleting formulas."]
[]
[]
[1,"Fill in the initial information in the green shaded cells below."]
[]
[null,"Client Name","Favourite Client Company"]
[null,"Client Address 1","Client Address 1"]
[null,"Client Address 2","Client Address 2"]
[null,"Client Representative","Favourite Person"]
[null,"Building Permit Number","18 111999 BLD 00 BA"]
[null,"Project Number","18.32001.00"]
[null,"Project Name","Award Winner"]
[null,"Project Type","Sustainable Office"]
[null,"Consultant","Visionary Architects"]
[null,"Consultant Address 1","Address line 1"]
[null,"Consultant Address 2","Address line 2"]
[null,"Consultant Telephone","(999) 123-4567"]
[null,"Consultant Fax","(000) 987-6543"]
[null,"Contractor","Quality Contractors Inc."]
[null,"Contract Amount",1234567.8899999999]
{"$rows_left_out":58}
{"sheet":"Record Docs","index":2,"n_rows":42,"n_cols":7,"rows_kept":42,"cut":false,"hidden":false,"merged":[[1,2,1,3],[23,1,23,6],[19,1,19,6],[21,1,21,6]]}
[null,"Proposed Value of As-Builts/Close-out Documents"]
[null,null,"Hide these 2 columns"]
[null,"Initial Contract Value:",null,null,{"$f":"'Project Info'!$C$30","v":1234567.8899999999}]
[]
[null,"Calculations of value based on percentage of initial contract value"]
["Calc 1","Initial Contract Value Range","Limits","Percentage",{"$f":"D6","v":"Percentage"},"As-Built Value","Rounded"]
[null,{"$f":"\"Less than $\"&$C$7","v":"Less than $150000"},150000,0.03,{"$f":"$D$7","v":0.03}]
[null,{"$f":"\"From $\"&$C$7&\" to $\"&$C$8","v":"From $150000 to $300000"},300000,0.02,{"$f":"$D$8","v":0.02}]
[null,{"$f":"\"From $\"&$C$8&\" to $\"&$C$9","v":"From $300000 to $750000"},750000,0.01,{"$f":"$D$9","v":0.01}]
[null,{"$f":"\"Greater than $\"&$C$9","v":"Greater than $750000"},null,5.0000000000000001E-3,{"$f":"$D$10","v":5.0000000000000001E-3}]
[null,null,null,null,{"$f":"$D$10","v":5.0000000000000001E-3}]
[null,null,null,null,{"$f":"IF($E$3<C7,D7,IF($E$3<C8,D8,IF($E$3<C9,D9,D10)))","v":5.0000000000000001E-3},{"$f":"$E$3*E12","v":6172.8394499999995},{"$f":"ROUNDUP(F12,-1)","v":6180}]
["Calc 2","Initial Contract Value","Differential",null,{"$f":"E6","v":"Percentage"},"As-Built Value","Rounded"]
[null,{"$f":"\"On the first $\"&$C$7","v":"On the first $150000"},{"$f":"$C$7","v":150000},{"$f":"$D$7","v":0.03},{"$f":"$D$7","v":0.03},{"$f":"IF($E$3>0,IF($E$3<$C$7,$E$3*$D$7,$C$7*$D$7),0)","v":4500}]
[null,{"$f":"\"On the next $\"&$C$8-$C$7","v":"On the next $150000"},{"$f":"$C$8-$C$7","v":150000},{"$f":"$D$8","v":0.02},{"$f":"$D$8","v":0.02},{"$f":"IF($E$3>$C$7,IF($E$3<$C$8,($E$3-$C$7)*$D$8,($C$8-$C$7)*$D$8),0)","v":3000}]
[null,{"$f":"\"On the next $\"&$C$9-$C$8","v":"On the next $450000"},{"$f":"$C$9-$C$8","v":450000},{"$f":"$D$9","v":0.01},{"$f":"$D$9","v":0.01},{"$f":"IF($E$3>$C$8,IF($E$3<$C$9,($E$3-$C$8)*$D$9,($C$9-$C$8)*$D$9),0)","v":4500}]
[null,{"$f":"\"On the remaining $\"&IF($E$3>$C$9,$E$3-$C$9,0)","v":"On the remaining $484567.89"},{"$f":"IF($E$3>$C$9,$E$3-$C$9,0)","v":484567.8899999999},{"$f":"$D$10","v":5.0000000000000001E-3},{"$f":"$D$10","v":5.0000000000000001E-3},{"$f":"IF($E$3<$C$9,0,($E$3-$C$9)*$D$10)","v":2422.8394499999995}]
[null,null,null,null,null,{"$f":"SUM(F14:F17)","v":14422.839449999999},{"$f":"ROUNDUP(F18,-1)","v":14430}]
[]
[null,{"$f":"\"If this value exceeds \"&TEXT($G$32,\"$0,0.00\")&\" then Substantial Performance/Completion cannot be achieved without Close-out Document completion.\"","v":"If this value exceeds $34,691.36 then Substantial Performance/Completion cannot be achieved without Close-out Document completion."}]
[]
[null,{"$f":"\"If this value is less than \"&TEXT($G$39,\"$0,0.00\")&\" then Deemed Completion can be achieved without Close-out Documents.\"","v":"If this value is less than $5,000.00 then Deemed Completion can be achieved without Close-out Documents."}]
[]
[null,"The appropriate record document value will vary depending on the nature of the project. Enter the desired value in the Schedule of Values before sending to the Contractor."]
[]
[]
[null,"Substantial Performance: ",null,null,null,null,{"$f":"\"Based on the \"&Lookups!$AE$30","v":"Based on the Construction Act, Ontario"}]
[null,"Initial Contract Amount",null,null,{"$f":"$E$3","v":1234567.8899999999}]
[null,{"$f":"Lookups!$O$30*100&\"% on 1st $\"&Lookups!$P$30","v":"3% on 1st $1000000"},null,null,{"$f":"IF(E28>Lookups!$P$30,Lookups!$P$30,E28)","v":1000000},{"$f":"Lookups!$O$30","v":0.03},{"$f":"ROUND($E29*$F29,2)","v":30000}]
[null,{"$f":"Lookups!$Q$30*100&\"% on next $\"&Lookups!$R$30","v":"2% on next $1000000"},null,null,{"$f":"IF(E28>Lookups!$P$30+Lookups!$R$30,Lookups!$R$30,E28-E29)","v":234567.8899999999},{"$f":"Lookups!$Q$30","v":0.02},{"$f":"ROUND($E30*$F30,2)","v":4691.3599999999997}]
{"$rows_left_out":13}
{"sheet":"App For Payment-Template","index":3,"n_rows":199,"n_cols":12,"rows_kept":199,"cut":false,"hidden":false,"merged":[[140,2,140,3],[140,4,140,5],[174,5,175,6],[180,4,180,5]]}
[{"$f":"'Project Info'!$C$16","v":"Favourite Client Company"},null,null,null,null,null,null,"Document 00 62 73"]
["Project Name:",{"$f":"'Project Info'!$C$22&\" - \"&'Project Info'!$C$23","v":"Award Winner - Sustainable Office"},null,null,null,null,null,"SCHEDULE OF VALUES"]
["Project Number:",{"$f":"'Project Info'!$C$21","v":"18.32001.00"},null,null,null,null,"Application for Payment #: ",0]
["Consultant:",{"$f":"'Project Info'!$C$24","v":"Visionary Architects"},null,null,null,null,"Issue Date:  ",{"$f":"NOW()","v":"2020-05-07T14:21:47.040"}]
["Contractor:",{"$f":"'Project Info'!$C$29","v":"Quality Contractors Inc."},null,null,null,null,"For Period Ending: ","2018-07-31"]
["Spec. Section","Item","Contract Amount","%\nto Date","Previous Amount","Amount\nThis Draw","Completed \nto Date","Balance\nto Complete"]
["General","Insurance",0,0,0,{"$f":"G7-E7","v":0},{"$f":"ROUND(C7*D7,2)","v":0},{"$f":"C7-G7","v":0}]
[null,"Bonding",0,0,0,0,0,0]
[null,"Mobilization",0,0,0,0,0,0]
[null,"Supervision",0,0,0,0,0,0]
[null,"Disposal",0,0,0,0,0,0]
[null,"Labour",0,0,0,0,0,0]
[null,"General Conditions",0,0,0,0,0,0]
["01 73 29","Cutting & Patching",0,0,0,0,0,0]
["01 77 00","Project Record Docs (Manuals/Docs/ As-builts)",0,0,0,0,0,0]
["03 33 00","Cast-in-Place Concrete (below grade)",0,0,0,{"$f":"G16-E16","v":0},{"$f":"ROUND(C16*D16,2)","v":0},{"$f":"C16-G16","v":0}]
["03 33 00","Cast-in-Place Concrete (above grade)",0,0,0,{"$f":"G17-E17","v":0},{"$f":"ROUND(C17*D17,2)","v":0},{"$f":"C17-G17","v":0}]
["03 45 00","Precast Concrete",0,0,0,{"$f":"G18-E18","v":0},{"$f":"ROUND(C18*D18,2)","v":0},{"$f":"C18-G18","v":0}]
["04 21 13","Brick Masonry",0,0,0,{"$f":"G19-E19","v":0},{"$f":"ROUND(C19*D19,2)","v":0},{"$f":"C19-G19","v":0}]
["04 22 00","Concrete Unit Masonry",0,0,0,{"$f":"G20-E20","v":0},{"$f":"ROUND(C20*D20,2)","v":0},{"$f":"C20-G20","v":0}]
["05 12 00","Structural Steel Framing",0,0,0,{"$f":"G21-E21","v":0},{"$f":"ROUND(C21*D21,2)","v":0},{"$f":"C21-G21","v":0}]
["05 31 00","Steel Decking",0,0,0,0,0,0]
["05 50 00","Metal Fabrications",0,0,0,0,0,0]
["05 73 00","Handrail Railings",0,0,0,0,0,0]
["06 10 00","Rough Carpentry",0,0,0,0,0,0]
["06 40 23","Architectural Woodwork",0,0,0,0,0,0]
["06 90 00","General Installations",0,0,0,0,0,0]
["07 24 15","EIFS",0,0,0,{"$f":"G28-E28","v":0},{"$f":"ROUND(C28*D28,2)","v":0},{"$f":"C28-G28","v":0}]
["07 51 00","Roofing",0,0,0,{"$f":"G29-E29","v":0},{"$f":"ROUND(C29*D29,2)","v":0},{"$f":"C29-G29","v":0}]
["07 62 00","Sheet Metal Flashing & Trim",0,0,0,{"$f":"G30-E30","v":0},{"$f":"ROUND(C30*D30,2)","v":0},{"$f":"C30-G30","v":0}]
{"$rows_left_out":170}
{"sheet":"Certificates For Payment","index":4,"n_rows":43,"n_cols":15,"rows_kept":43,"cut":false,"hidden":false,"merged":[[13,0,13,9],[20,1,20,4],[20,7,20,9],[23,7,23,9],[18,0,18,4],[18,7,18,9],[14,0,14,9],[16,0,16,9]]}
[{"$f":"'Project Info'!C24","v":"Visionary Architects"},null,null,null,null,null,null,"Certificate for Payment",null,null,null,null,"template",{"$f":"IF($M$1=\"Template\",\"App For Payment-\" & $M$1, IF($M$1<10,\"App For Payment-0\" & $M$1,\"App For Payment-\" & $M$1))","v":"App For Payment-template"},"Enter the number of the Application for Payment for which you want to show the Certificate for Payment:"]
[{"$f":"'Project Info'!C25","v":"Address line 1"},null,null,null,null,null,null,null,null,null,null,null,null,{"$f":"IF($M$1=\"Template\",\"StartDate\", IF($M$1<2,\"StartDate\",IF($M$1<11,\"App For Payment-0\" & $M$1-1,\"App For Payment-\" & $M$1-1)))","v":"StartDate"}]
[{"$f":"'Project Info'!C26","v":"Address line 2"}]
[{"$f":"\"Tel: \" & 'Project Info'!C27 & \"     Fax: \" &  'Project Info'!C28","v":"Tel: (999) 123-4567     Fax: (000) 987-6543"},null,null,null,null,null,null,null,null,null,null,null,null,{"$f":"COLUMN(INDIRECT(\"'\"& $N$1 & \"'\" &\"!CertQualifier\"))","v":3}]
[null,null,null,null,null,null,null,null,null,null,null,null,null,{"$f":"ROW(INDIRECT(\"'\"& $N$1 & \"'\" &\"!CertQualifier\"))","v":141}]
["Project:",null,{"$f":"'Project Info'!C22","v":"Award Winner"},null,null,null,null,"Certificate for Payment:",{"$f":"$M$1","v":"template"},null,null,null,null,{"$f":"ADDRESS(N5,N4,4,1)","v":"C141"}]
["Project Number:",null,{"$f":"'Project Info'!C21","v":"18.32001.00"},null,null,null,null,{"$f":"IF(INDIRECT(\"'\"& $N$1 & \"'\" & \"!CertQualifier\")=\"-\",\"Select Certificate qualifier in cell \" & $N$6 & \" on the AfP tab before printing this certificate.\",INDIRECT(\"'\"& $N$1 & \"'\" &\"!CertQualifier\"))","v":"Select Certificate qualifier in cell C141 on the AfP tab before printing this certificate."}]
["Owner:",null,{"$f":"'Project Info'!C16","v":"Favourite Client Company"},null,null,null,null,"Issue Date:",{"$f":"TEXT(INDIRECT(\"'\"& $N$1 & \"'\" &\"!IssueDate\"), \"YYYY MM DD\")","v":"2020 05 07"}]
[null,null,{"$f":"'Project Info'!C17","v":"Client Address 1"}]
[null,null,{"$f":"'Project Info'!C18","v":"Client Address 2"}]
[]
["Attention:",null,{"$f":"'Project Info'!C19","v":"Favourite Person"},null,null,null,null,"File:"]
[]
[{"$f":"\"This is to certify that \"&'Project Info'!C29&\" has completed work and delivered products to the place of the work to date, to the value of \"&TEXT(E31,\"$#,##0.00\")&\" and is entitled to \"&TEXT(H43,\"$#,##0.00\")&\" for the period from \" & TEXT( INDIRECT($N$2), \"MMMM DD, YYYY\")&\" to \"&TEXT( INDIRECT(\"'\"&$N$1&\"'\"&\"!PeriodEnding\"),\"MMMM DD, YYYY\")&\".\"","v":"This is to certify that Quality Contractors Inc. has completed work and delivered products to the place of the work to date, to the value of $0.00 and is entitled to $0.00 for the period from July 01, 2018 to July 31, 2018."}]
["By law, the amount certified is subject to reduction by the amount of any lien of which you have received written notice. The certificate is not negotiable, and is payable to the payee named in it. Issuance, payment, and acceptance are without prejudice to any rights of the Owner or Contractor under their contract."]
[]
["The issue of this Certificate for Payment shall not be taken as a representation that the Consultant has made any examination to ascertain how and for what purpose the Contractor has used monies paid on account of the contract or that the Contractor has discharged the obligations imposed on him/her by law under the Worker's Compensation Act, or other applicable statutes, non-compliance with which may render the Client personaly liable for the Contractor's default."]
[]
[{"$f":"'Project Info'!C24","v":"Visionary Architects"},null,null,null,null,null,null,{"$f":"'Project Info'!C29","v":"Quality Contractors Inc."}]
[]
["Per:"]
["Consultant's Signature:",null,null,null,null,null,null,"Contractor's Acknowledgement"]
[]
[]
[null,null,null,null,null,null,null,"Date"]
[]
[]
["Original Contract Amount",null,null,null,{"$f":"'Project Info'!$C$30","v":1234567.8899999999}]
["Total Changes to Date",null,null,null,{"$f":"INDIRECT(\"'\"& $N$1 & \"'\" &\"!ChangesToDate\")","v":0}]
["Current Contract Amount",null,null,null,{"$f":"E28+E29","v":1234567.8899999999},null,null,{"$f":"E30","v":1234567.8899999999}]
{"$rows_left_out":14}
{"sheet":"Cert For Pay (Annual or Phased)","index":5,"n_rows":42,"n_cols":15,"rows_kept":42,"cut":false,"hidden":false,"merged":[[23,7,23,9],[13,0,13,9],[14,0,14,9],[16,0,16,9],[18,0,18,4],[18,7,18,9],[20,1,20,4],[20,7,20,9]]}
[{"$f":"'Project Info'!C24","v":"Visionary Architects"},null,null,null,null,null,null,"Certificate for Payment",null,null,null,null,"template",{"$f":"IF($M$1=\"Template\",\"App For Payment-\" & $M$1, IF($M$1<10,\"App For Payment-0\" & $M$1,\"App For Payment-\" & $M$1))","v":"App For Payment-template"},"Enter the number of the Application for Payment for which you want to show the Certificate for Payment:"]
[{"$f":"'Project Info'!C25","v":"Address line 1"},null,null,null,null,null,null,null,null,null,null,null,null,{"$f":"IF($M$1=\"Template\",\"StartDate\", IF($M$1<2,\"StartDate\",IF($M$1<11,\"App For Payment-0\" & $M$1-1,\"App For Payment-\" & $M$1-1)))","v":"StartDate"}]
[{"$f":"'Project Info'!C26","v":"Address line 2"}]
[{"$f":"\"Tel: \" & 'Project Info'!C27 & \"     Fax: \" &  'Project Info'!C28","v":"Tel: (999) 123-4567     Fax: (000) 987-6543"},null,null,null,null,null,null,null,null,null,null,null,null,{"$f":"COLUMN(INDIRECT(\"'\"& $N$1 & \"'\" &\"!CertQualifier\"))","v":3}]
[null,null,null,null,null,null,null,null,null,null,null,null,null,{"$f":"ROW(INDIRECT(\"'\"& $N$1 & \"'\" &\"!CertQualifier\"))","v":141}]
["Project:",null,{"$f":"'Project Info'!C22","v":"Award Winner"},null,null,null,null,"Certificate for Payment:",{"$f":"$M$1","v":"template"},null,null,null,null,{"$f":"ADDRESS(N5,N4,4,1)","v":"C141"}]
["Project Number:",null,{"$f":"'Project Info'!C21","v":"18.32001.00"},null,null,null,null,{"$f":"IF(INDIRECT(\"'\"& $N$1 & \"'\" & \"!CertQualifier\")=\"-\",\"Select Certificate qualifier in cell \" & $N$6 & \" on the AfP tab before printing this certificate.\",INDIRECT(\"'\"& $N$1 & \"'\" &\"!CertQualifier\"))","v":"Select Certificate qualifier in cell C141 on the AfP tab before printing this certificate."}]
["Owner:",null,{"$f":"'Project Info'!C16","v":"Favourite Client Company"},null,null,null,null,"Issue Date:",{"$f":"TEXT(INDIRECT(\"'\"& $N$1 & \"'\" &\"!IssueDate\"), \"YYYY MM DD\")","v":"2020 05 07"}]
[null,null,{"$f":"'Project Info'!C17","v":"Client Address 1"}]
[null,null,{"$f":"'Project Info'!C18","v":"Client Address 2"}]
[]
["Attention:",null,{"$f":"'Project Info'!C19","v":"Favourite Person"},null,null,null,null,"File:"]
[]
[{"$f":"\"This is to certify that \"&'Project Info'!C29&\" has completed work and delivered products to the place of the work to date, to the value of \"&TEXT(E31,\"$#,##0.00\")&\" and is entitled to \"&TEXT(H42,\"$#,##0.00\")&\" for the period from \" & TEXT( INDIRECT($N$2), \"MMMM DD, YYYY\")&\" to \"&TEXT( INDIRECT(\"'\"&$N$1&\"'\"&\"!PeriodEnding\"),\"MMMM DD, YYYY\")&\".\"","v":"This is to certify that Quality Contractors Inc. has completed work and delivered products to the place of the work to date, to the value of $0.00 and is entitled to $0.00 for the period from July 01, 2018 to July 31, 2018."}]
["By law, the amount certified is subject to reduction by the amount of any lien of which you have received written notice. The certificate is not negotiable, and is payable to the payee named in it. Issuance, payment, and acceptance are without prejudice to any rights of the Owner or Contractor under their contract."]
[]
["The issue of this Certificate for Payment shall not be taken as a representation that the Consultant has made any examination to ascertain how and for what purpose the Contractor has used monies paid on account of the contract or that the Contractor has discharged the obligations imposed on him/her by law under the Worker's Compensation Act, or other applicable statutes, non-compliance with which may render the Client personaly liable for the Contractor's default."]
[]
[{"$f":"'Project Info'!C24","v":"Visionary Architects"},null,null,null,null,null,null,{"$f":"'Project Info'!C29","v":"Quality Contractors Inc."}]
[]
["Per:"]
["Consultant's Signature:",null,null,null,null,null,null,"Contractor's Acknowledgement"]
[]
[]
[null,null,null,null,null,null,null,"Date"]
[]
[]
["Original Contract Amount",null,null,null,{"$f":"'Project Info'!$C$30","v":1234567.8899999999}]
["Total Changes to Date",null,null,null,{"$f":"INDIRECT(\"'\"& $N$1 & \"'\" &\"!ChangesToDate\")","v":0}]
["Current Contract Amount",null,null,null,{"$f":"E28+E29","v":1234567.8899999999},null,null,{"$f":"E30","v":1234567.8899999999}]
{"$rows_left_out":13}
{"sheet":"Lookups","index":6,"n_rows":101,"n_cols":32,"rows_kept":101,"cut":false,"hidden":false,"merged":[[46,8,46,9],[26,26,26,29],[16,10,16,11],[26,14,26,19],[26,8,26,13],[26,22,26,25],[26,20,26,21]]}
[]
["Project location:",{"$f":"Province","v":" Ontario "}]
[null,null,null,null,null,null,"ProvinceList",null,null,null,"CfP_Purpose",null,null,null,"HB_Release"]
[null,null,null,null,null,null," Ontario ",null,null,null,"-",null,null,null,"-"]
[null,null,null,null,null,null," British Columbia ",null,null,null,"Progress Payment",null,null,null,"Substantial Performance"]
[null,null,null,null,null,null," Alberta ",null,null,null,"Substantial Performance",null,null,null,"Completion"]
[null,null,null,null,null,null," Saskatchewan ",null,null,null,"Release of Basic Holdback",null,null,null,"Annual Release"]
[null,null,null,null,null,null," Manitoba ",null,null,null,"Release of Finishing Holdback",null,null,null,"Phased Release"]
[null,null,null,null,null,null," Quebec",null,null,null,"Release of Holdback"]
["DOW","Name","Add to skip weekend",null,null,null," New Brunswick ",null,null,null,"Release of Holdback (Annual)"]
[1,"Sunday",1,null,null,null," Nova Scotia ",null,null,null,"Release of Holdback (Phased)"]
[2,"Monday",0,null,null,null," Prince Edward Island ",null,null,null,"Deemed Completion"]
[3,"Tuesday",0,null,null,null," Newfoundland ",null,null,null,"Completion"]
[4,"Wednesday",0,null,null,null," Yukon ",null,null,null,"Achevement substantiel de l'ouvrage"]
[5,"Thursday",0,null,null,null," Nunavut "]
[6,"Friday",0,null,null,null," Northwest Territory "]
[7,"Saturday",2,null,null,null,null,null,null,null,"Deemed Completion"]
[]
[]
[null,null,null,"GST",0.05]
[null,null,null,"QST",9.5000000000000001E-2]
[null,null,null,"QST_Blended",{"$f":"((1+E20)*(1+E21)-1)","v":0.14975000000000005}]
[]
["The information in this table must be manually updated to reflect any changes in the applicable lien legislation or tax rates."]
["The information was valid when first entered, but must be confirmed in each jurisdiction prior to use for that jurisdiction."]
[]
[null,null,null,null,null,null,null,null,"Calculation of Basic Holdback",null,null,null,null,null,"Calculation of Substantial Performance",null,null,null,null,null,"Release of Basic Holdback",null,"Calculation of Finishing Holdback",null,null,null,"Release of Finishing Holdback"]
[null,0,1,2,3,4,5,6,7,8,9,10,11,12,13,14,15,16,17,18,19,20,21,22,23,24,25,26,27,28,29,30]
[null,"Province/Territory","Location Selected","Prov Tax Type","Prov Tax Rate","VAT Tax Type","VAT Tax Rate","Tax Rate","Basic Holdback %","%","Change of Rate Threshold","%","Minimum Holdback @ Rate Change"," Lien Period ","%","Limit","%","Limit","%",null,"Lien Period Trigger","Document Issued/Status Achieved","Finishing Holdback ","Finishing Lien Period ","%","Limit of Outstanding Work","Lien Period Trigger",null,null,null,"Legislation","Comments"]
["Selected:",{"$f":"Province","v":" Ontario "},"X",{"$f":"VLOOKUP(\"X\",$C$31:$AF$44,D$28,FALSE)","v":0},0,"HST",0.13,0.13,0.1,0,0,1,0,60,0.03,1000000,0.02,1000000,0.01,0,"Date of Publication","Certificate of Substantial Performance",0.1,60,0.01,5000,"Deemed Completion","Finishing Holdback","Substantially Performed","Deemed Complete","Construction Act, Ontario",0]
{"$rows_left_out":72}
{"sheet":"Sheet1","index":7,"n_rows":8,"n_cols":3,"rows_kept":8,"cut":false,"hidden":true,"merged":[]}
["DOW","Name","Add to skip weekend"]
[1,"Sunday",1]
[2,"Monday",0]
[3,"Tuesday",0]
[4,"Wednesday",0]
[5,"Thursday",0]
[6,"Friday",0]
[7,"Saturday",2]